Target
Mitogen-activated protein kinase 10
Ligand
BDBM50297463
Substrate
Meas. Tech.
ChEMBL_586022 (CHEMBL1063579)
Ki
300±n/a nM
Citation
 Cao, JGao, HBemis, GSalituro, FLedeboer, MHarrington, EWilke, STaslimi, PPazhanisamy, SXie, XJacobs, MGreen, J Structure-based design and parallel synthesis of N-benzyl isatin oximes as JNK3 MAP kinase inhibitors. Bioorg Med Chem Lett 19:2891-5 (2009)  
Target
Name:
Mitogen-activated protein kinase 10
Synonyms:
JNK3 MAP kinase p49 3F12 MK10_HUMAN Mitogen-activated protein kinase 10 (Stress-activated protein kinase JNK3) (c-Jun N-terminal kinase 3) (MAP kinase p49 3F12) PRKM10 Stress-activated protein kinase JNK3 | c-Jun N-terminal kinase 3 (JNK3)
Type:
Enzyme
Mol. Mass.:
52586.89
Organism:
Homo sapiens (Human)
Description:
Residue:
464
  
Inhibitor
Name:
BDBM50297463
Synonyms:
1-((6-fluoro-4H-benzo[d][1,3]dioxin-8-yl)methyl)-3-(hydroxyimino)-2-oxoindoline-6-carboxylic acid | CHEMBL556925
Type:
Small organic molecule
Emp. Form.:
C18H13FN2O6
Mol. Mass.:
372.304
SMILES:
OC(=O)c1ccc2C(N=O)C(=O)N(Cc3cc(F)cc4COCOc34)c2c1
: