Target
Mitogen-activated protein kinase 10
Ligand
BDBM50297461
Substrate
Meas. Tech.
ChEMBL_586022 (CHEMBL1063579)
Ki
740±n/a nM
Citation
 Cao, JGao, HBemis, GSalituro, FLedeboer, MHarrington, EWilke, STaslimi, PPazhanisamy, SXie, XJacobs, MGreen, J Structure-based design and parallel synthesis of N-benzyl isatin oximes as JNK3 MAP kinase inhibitors. Bioorg Med Chem Lett 19:2891-5 (2009)  
Target
Name:
Mitogen-activated protein kinase 10
Synonyms:
JNK3 MAP kinase p49 3F12 MK10_HUMAN Mitogen-activated protein kinase 10 (Stress-activated protein kinase JNK3) (c-Jun N-terminal kinase 3) (MAP kinase p49 3F12) PRKM10 Stress-activated protein kinase JNK3 | c-Jun N-terminal kinase 3 (JNK3)
Type:
Enzyme
Mol. Mass.:
52586.89
Organism:
Homo sapiens (Human)
Description:
Residue:
464
  
Inhibitor
Name:
BDBM50297461
Synonyms:
(3Z)-1-[(6-fluoro-4H-1,3-benzodioxin-8-yl)methyl]-4-[(E)-2-phenylethenyl]-1H-indole-2,3-dione 3-oxime CHEMBL561540
Type:
Small organic molecule
Emp. Form.:
C25H19FN2O4
Mol. Mass.:
430.4278
SMILES:
Fc1cc(CN2C(=O)C(N=O)c3c2cccc3C=Cc2ccccc2)c2OCOCc2c1
: