Target
Mitogen-activated protein kinase 10
Ligand
BDBM50297473
Substrate
Meas. Tech.
ChEMBL_586022 (CHEMBL1063579)
Ki
790±n/a nM
Citation
 Cao, JGao, HBemis, GSalituro, FLedeboer, MHarrington, EWilke, STaslimi, PPazhanisamy, SXie, XJacobs, MGreen, J Structure-based design and parallel synthesis of N-benzyl isatin oximes as JNK3 MAP kinase inhibitors. Bioorg Med Chem Lett 19:2891-5 (2009)  
Target
Name:
Mitogen-activated protein kinase 10
Synonyms:
JNK3 MAP kinase p49 3F12 MK10_HUMAN Mitogen-activated protein kinase 10 (Stress-activated protein kinase JNK3) (c-Jun N-terminal kinase 3) (MAP kinase p49 3F12) PRKM10 Stress-activated protein kinase JNK3 | c-Jun N-terminal kinase 3 (JNK3)
Type:
Enzyme
Mol. Mass.:
52586.89
Organism:
Homo sapiens (Human)
Description:
Residue:
464
  
Inhibitor
Name:
BDBM50297473
Synonyms:
1-(3,5-dimethoxybenzyl)-5-fluoro-3-(hydroxyimino)indolin-2-one | CHEMBL550939
Type:
Small organic molecule
Emp. Form.:
C17H15FN2O4
Mol. Mass.:
330.3104
SMILES:
COc1cc(CN2C(=O)C(N=O)c3cc(F)ccc23)cc(OC)c1
: