Target
Autoinducer 2-binding periplasmic protein LuxP
Ligand
BDBM50165862
Substrate
Meas. Tech.
ChEMBL_586175 (CHEMBL1052740)
EC50
150±n/a nM
Citation
 Ganin, HTang, XMeijler, MM Inhibition of Pseudomonas aeruginosa quorum sensing by AI-2 analogs. Bioorg Med Chem Lett 19:3941-4 (2009)  
Target
Name:
Autoinducer 2-binding periplasmic protein LuxP
Synonyms:
LUXP_VIBHA | luxP
Type:
PROTEIN
Mol. Mass.:
41453.75
Organism:
Vibrio harveyi
Description:
ChEMBL_1513759
Residue:
365
  
Inhibitor
Name:
BDBM50165862
Synonyms:
(4S)-4,5-dihydroxypentane-2,3-dione 4,5-Dihydroxy-2,3-pentanedione CHEMBL194166
Type:
Small organic molecule
Emp. Form.:
C5H8O4
Mol. Mass.:
132.1146
SMILES:
CC(O)C(=O)C(=O)CO
: