Target
Prostaglandin G/H synthase 2
Ligand
BDBM50297561
Substrate
Meas. Tech.
ChEMBL_583549 (CHEMBL1059064)
IC50
2500±n/a nM
Citation
 Husain, AAhmad, AAlam, MMAjmal, MAhuja, P Fenbufen based 3-[5-(substituted aryl)-1,3,4-oxadiazol-2-yl]-1-(biphenyl-4-yl)propan-1-ones as safer antiinflammatory and analgesic agents. Eur J Med Chem 44:3798-804 (2009)  
Target
Name:
Prostaglandin G/H synthase 2
Synonyms:
COX2 Cyclooxygenase-2 (COX-2) PTGS2 Prostaglandin G/H synthase (cyclooxygenase)
Type:
Protein
Mol. Mass.:
68976.98
Organism:
Ovis aries (Sheep)
Description:
Residue:
603
  
Inhibitor
Name:
BDBM50297561
Synonyms:
3-[(5-(2-Naphthoxymethyl)-1,3,4-oxadiazol-2-yl)-1-(biphenyl-4-yl)propan-1-one | CHEMBL559814
Type:
Small organic molecule
Emp. Form.:
C28H22N2O3
Mol. Mass.:
434.4859
SMILES:
O=C(CCc1nnc(COc2ccc3ccccc3c2)o1)c1ccc(cc1)-c1ccccc1
: