Target
C-X-C chemokine receptor type 1
Ligand
BDBM50297737
Substrate
Meas. Tech.
ChEMBL_584048 (CHEMBL1055928)
Ki
21±n/a nM
Citation
 Aki, CChao, JFerreira, JADwyer, MPYu, YChao, JMerritt, RJLai, GWu, MHipkin, RWFan, XGonsiorek, WFosseta, JRindgen, DFine, JLundell, DTaveras, AGBiju, P Diaminocyclobutenediones as potent and orally bioavailable CXCR2 receptor antagonists: SAR in the phenolic amide region. Bioorg Med Chem Lett 19:4446-9 (2009)  
Target
Name:
C-X-C chemokine receptor type 1
Synonyms:
C-X-C chemokine receptor type 1 (CXCR-1) CMKAR1 CXCR1_HUMAN Interleukin-8 receptor A | Interleukin-8 receptors, CXCR1/CXCR2
Type:
Enzyme
Mol. Mass.:
39803.83
Organism:
Homo sapiens (Human)
Description:
P25024
Residue:
350
  
Inhibitor
Name:
BDBM50297737
Synonyms:
(R)-3-(2-hydroxy-3-((S)-3-hydroxypyrrolidine-1-carbonyl)phenylamino)-4-(1-phenylpropylamino)cyclobut-3-ene-1,2-dione | CHEMBL556656
Type:
Small organic molecule
Emp. Form.:
C24H25N3O5
Mol. Mass.:
435.4724
SMILES:
CC[C@@H](Nc1c(Nc2cccc(C(=O)N3CC[C@H](O)C3)c2O)c(=O)c1=O)c1ccccc1
: