Target
Cytochrome P450 2D6
Ligand
BDBM22877
Substrate
Meas. Tech.
ChEMBL_584295 (CHEMBL1060929)
Ki
>20000±n/a nM
Citation
 Coon, TMoree, WJLi, BYu, JZamani-Kord, SMalany, SSantos, MAHernandez, LMPetroski, RESun, AWen, JSullivan, SHaelewyn, JHedrick, MHoare, SJBradbury, MJCrowe, PDBeaton, G Brain-penetrating 2-aminobenzimidazole H(1)-antihistamines for the treatment of insomnia. Bioorg Med Chem Lett 19:4380-4 (2009)  
Target
Name:
Cytochrome P450 2D6
Synonyms:
CP2D6_HUMAN CYP2DL1 Cytochrome P450 2D6 (CYP2D6) P450-DB1
Type:
Protein
Mol. Mass.:
55774.82
Organism:
Homo sapiens (Human)
Description:
P10635
Residue:
497
  
Inhibitor
Name:
BDBM22877
Synonyms:
2-((1-(1-(4-fluorobenzyl)-1H-benzo[d]imidazol-2-yl)piperidin-4-yl)(methyl)amino)pyrimidin-4(3H)-one 2-({1-[3-(4-Fluoro-benzyl)-1H-benzoimidazol-2-yl]-piperidin-4-yl}-methyl-amino)-2,3-dihydro-1H-pyrimidin-4-one(Mizolastine) CHEMBL94454 Mizollen | Zolistan
Type:
Small organic molecule
Emp. Form.:
C24H25FN6O
Mol. Mass.:
432.4933
SMILES:
CN(C1CCN(CC1)c1nc2ccccc2n1Cc1ccc(F)cc1)c1nccc(=O)[nH]1
: