Target
Growth factor receptor-bound protein 2
Ligand
BDBM50300042
Substrate
Meas. Tech.
ChEMBL_593416 (CHEMBL1040544)
IC50
11±n/a nM
Citation
 Courme, CGresh, NVidal, MLenoir, CGarbay, CFlorent, JCBertounesque, E Synthesis of aryl phosphates based on pyrimidine and triazine scaffolds. Eur J Med Chem 45:244-55 (2010)  
Target
Name:
Growth factor receptor-bound protein 2
Synonyms:
ASH GRB2 adapter protein Grb2-SH2 | Growth factor receptor-bound protein 2
Type:
Protein
Mol. Mass.:
25205.04
Organism:
Homo sapiens (Human)
Description:
P62993
Residue:
217
  
Inhibitor
Name:
BDBM50300042
Synonyms:
4-[(2S)-2-{[(1S)-1-{[(1S)-1,2-dicarbamoylethyl]carbamoyl}-1-{[4-(phosphonooxy)phenyl]methyl}ethyl]carbamoyl}-2-(2-methyl-2-{4-methyl-2-[(E)-2-phenyldiazen-1-yl]phenoxy}propanamido)ethyl]phenoxyphosphonic acid | CHEMBL582892
Type:
Small organic molecule
Emp. Form.:
C40H47N7O14P2
Mol. Mass.:
911.7872
SMILES:
Cc1ccc(OC(C)(C)C(=O)N[C@@H](Cc2ccc(OP(O)(O)=O)cc2)C(=O)N[C@@](C)(Cc2ccc(OP(O)(O)=O)cc2)C(=O)N[C@@H](CC(N)=O)C(N)=O)c(c1)\N=N\c1ccccc1
: