Target
High affinity cGMP-specific 3',5'-cyclic phosphodiesterase 9A
Ligand
BDBM50300101
Substrate
Meas. Tech.
ChEMBL_593497 (CHEMBL1047621)
IC50
66±n/a nM
Citation
 Verhoest, PRProulx-Lafrance, CCorman, MChenard, LHelal, CJHou, XKleiman, RLiu, SMarr, EMenniti, FSSchmidt, CJVanase-Frawley, MSchmidt, AWWilliams, RDNelson, FRFonseca, KRLiras, S Identification of a brain penetrant PDE9A inhibitor utilizing prospective design and chemical enablement as a rapid lead optimization strategy. J Med Chem 52:7946-9 (2009)  
Target
Name:
High affinity cGMP-specific 3',5'-cyclic phosphodiesterase 9A
Synonyms:
3',5'-cyclic phosphodiesterase PDE9A_HUMAN Phosphodiesterase 9A (PDE9) | Phosphodiesterase 9A (PDE9A)
Type:
Protein
Mol. Mass.:
68488.40
Organism:
Homo sapiens (Human)
Description:
O76083
Residue:
593
  
Inhibitor
Name:
BDBM50300101
Synonyms:
6-[(3,4-trans)-1-benzyl-4-methylpyrrolidin-3-yl]-1-cyclopentyl-15-dihydro-4H-pyrazolo[34-d]pyrimidin-4-one CHEMBL572517
Type:
Small organic molecule
Emp. Form.:
C20H25N5O
Mol. Mass.:
351.4454
SMILES:
CC(C)n1ncc2c1nc([nH]c2=O)[C@@H]1CN(Cc2ccccc2)C[C@H]1C
: