Target
P2Y purinoceptor 12
Ligand
BDBM50302440
Substrate
Meas. Tech.
ChEMBL_597610 (CHEMBL1050573)
Ki
367±n/a nM
Citation
 Kortum, SWLachance, RMSchweitzer, BAYalamanchili, GRahman, HEnnis, MDHuff, RMTenBrink, RE Thienopyrimidine-based P2Y12 platelet aggregation inhibitors. Bioorg Med Chem Lett 19:5919-23 (2009)  
Target
Name:
P2Y purinoceptor 12
Synonyms:
ADP-glucose receptor HORK3 P2T(AC) P2Y(AC) P2Y(cyc) P2Y12 platelet ADP receptor Purinergic receptor P2Y12 | SP1999
Type:
Enzyme
Mol. Mass.:
39458.48
Organism:
Homo sapiens (Human)
Description:
Q9H244
Residue:
342
  
Inhibitor
Name:
BDBM50302440
Synonyms:
3-(3-(6-ethyl-4-(4-propionylpiperazin-1-yl)thieno[2,3-d]pyrimidin-2-yl)ureido)propanoic acid | CHEMBL568127
Type:
Small organic molecule
Emp. Form.:
C19H26N6O4S
Mol. Mass.:
434.513
SMILES:
CCC(=O)N1CCN(CC1)c1nc(NC(=O)NCCC(O)=O)nc2sc(CC)cc12
: