Target
P2Y purinoceptor 12
Ligand
BDBM50302438
Substrate
Meas. Tech.
ChEMBL_597609 (CHEMBL1050572)
Ki
213±n/a nM
Citation
 Kortum, SWLachance, RMSchweitzer, BAYalamanchili, GRahman, HEnnis, MDHuff, RMTenBrink, RE Thienopyrimidine-based P2Y12 platelet aggregation inhibitors. Bioorg Med Chem Lett 19:5919-23 (2009)  
Target
Name:
P2Y purinoceptor 12
Synonyms:
ADP-glucose receptor HORK3 P2T(AC) P2Y(AC) P2Y(cyc) P2Y12 platelet ADP receptor Purinergic receptor P2Y12 | SP1999
Type:
Enzyme
Mol. Mass.:
39458.48
Organism:
Homo sapiens (Human)
Description:
Q9H244
Residue:
342
  
Inhibitor
Name:
BDBM50302438
Synonyms:
3-(3-(6-ethyl-4-(4-(3-phenoxypropanoyl)piperazin-1-yl)thieno[2,3-d]pyrimidin-2-yl)ureido)propanoic acid | CHEMBL585306
Type:
Small organic molecule
Emp. Form.:
C25H30N6O5S
Mol. Mass.:
526.608
SMILES:
CCc1cc2c(nc(NC(=O)NCCC(O)=O)nc2s1)N1CCN(CC1)C(=O)CCOc1ccccc1
: