Target
5-hydroxytryptamine receptor 2B
Ligand
BDBM50302555
Substrate
Meas. Tech.
ChEMBL_594563 (CHEMBL1037058)
IC50
31±n/a nM
Citation
 Semple, GTran, TAKramer, BHsu, DHan, SChoi, JVallar, PCasper, MDZou, NHauser, EKThomsen, WWhelan, KSengupta, DMorgan, MSekiguchi, YKanuma, KChaki, SGrottick, AJ Pyrimidine-based antagonists of h-MCH-R1 derived from ATC0175: in vitro profiling and in vivo evaluation. Bioorg Med Chem Lett 19:6166-71 (2009)  
Target
Name:
5-hydroxytryptamine receptor 2B
Synonyms:
5-HT-2B 5-hydroxytryptamine (serotonin) receptor 2B [Homo sapiens] 5-hydroxytryptamine receptor 2C (5HT2C) HTR2B Serotonin 2b (5-HT2b) receptor | Serotonin Receptor 2B
Type:
G Protein-Coupled Receptor (GPCR)
Mol. Mass.:
54312.47
Organism:
Homo sapiens (Human)
Description:
Receptor binding assays were performed using human clone stably expressed in CHO cells.
Residue:
481
  
Inhibitor
Name:
BDBM50302555
Synonyms:
CHEMBL567993 | N-((cis)-4-(4-(dimethylamino)-5-methylpyrimidin-2-ylamino)cyclohexyl)-3-methylbenzamide
Type:
Small organic molecule
Emp. Form.:
C21H29N5O
Mol. Mass.:
367.4879
SMILES:
CN(C)c1nc(N[C@@H]2CC[C@@H](CC2)NC(=O)c2cccc(C)c2)ncc1C
: