Target
P2Y purinoceptor 12
Ligand
BDBM50302695
Substrate
Meas. Tech.
ChEMBL_595036 (CHEMBL1042521)
Ki
0.79±n/a nM
Citation
 Parlow, JJBurney, MWCase, BLGirard, TJHall, KAHiebsch, RRHuff, RMLachance, RMMischke, DARapp, SRWoerndle, RSEnnis, MD Piperazinyl-glutamate-pyrimidines as potent P2Y12 antagonists for inhibition of platelet aggregation. Bioorg Med Chem Lett 19:6148-56 (2009)  
Target
Name:
P2Y purinoceptor 12
Synonyms:
ADP-glucose receptor HORK3 P2T(AC) P2Y(AC) P2Y(cyc) P2Y12 platelet ADP receptor Purinergic receptor P2Y12 | SP1999
Type:
Enzyme
Mol. Mass.:
39458.48
Organism:
Homo sapiens (Human)
Description:
Q9H244
Residue:
342
  
Inhibitor
Name:
BDBM50302695
Synonyms:
(S)-5-(4-(butoxycarbonyl)piperazin-1-yl)-4-(6-(4-(diethylcarbamoyl)piperidin-1-yl)-2-phenylpyrimidine-4-carboxamido)-5-oxopentanoic acid | CHEMBL568211
Type:
Small organic molecule
Emp. Form.:
C35H49N7O7
Mol. Mass.:
679.8063
SMILES:
CCCCOC(=O)N1CCN(CC1)C(=O)[C@H](CCC(O)=O)NC(=O)c1cc(nc(n1)-c1ccccc1)N1CCC(CC1)C(=O)N(CC)CC
: