Target
P2Y purinoceptor 12
Ligand
BDBM50302647
Substrate
Meas. Tech.
ChEMBL_595036 (CHEMBL1042521)
Ki
11±n/a nM
Citation
 Parlow, JJBurney, MWCase, BLGirard, TJHall, KAHiebsch, RRHuff, RMLachance, RMMischke, DARapp, SRWoerndle, RSEnnis, MD Piperazinyl-glutamate-pyrimidines as potent P2Y12 antagonists for inhibition of platelet aggregation. Bioorg Med Chem Lett 19:6148-56 (2009)  
Target
Name:
P2Y purinoceptor 12
Synonyms:
ADP-glucose receptor HORK3 P2T(AC) P2Y(AC) P2Y(cyc) P2Y12 platelet ADP receptor Purinergic receptor P2Y12 | SP1999
Type:
Enzyme
Mol. Mass.:
39458.48
Organism:
Homo sapiens (Human)
Description:
Q9H244
Residue:
342
  
Inhibitor
Name:
BDBM50302647
Synonyms:
(S)-4-(4-(4-methylpiperazin-1-yl)-6-phenylpyrimidine-2-carboxamido)-5-oxo-5-(4-(pentyloxycarbonyl)piperazin-1-yl)pentanoic acid | CHEMBL567840
Type:
Small organic molecule
Emp. Form.:
C31H43N7O6
Mol. Mass.:
609.7164
SMILES:
CCCCCOC(=O)N1CCN(CC1)C(=O)[C@H](CCC(O)=O)NC(=O)c1nc(cc(n1)-c1ccccc1)N1CCN(C)CC1
: