Target
Dual specificity protein phosphatase 3
Ligand
BDBM28884
Substrate
Meas. Tech.
ChEMBL_595106 (CHEMBL1047966)
IC50
270±n/a nM
Citation
 Wu, SVossius, SRahmouni, SMiletic, AVVang, TVazquez-Rodriguez, JCerignoli, FArimura, YWilliams, SHayes, TMoutschen, MVasile, SPellecchia, MMustelin, TTautz, L Multidentate small-molecule inhibitors of vaccinia H1-related (VHR) phosphatase decrease proliferation of cervix cancer cells. J Med Chem 52:6716-23 (2009)  
Target
Name:
Dual specificity protein phosphatase 3
Synonyms:
DUS3_HUMAN Dual specificity protein phosphatase (VHR) Dual specificity protein phosphatase VHR Tyrosine-protein phosphatase non-receptor type 1 | VHR
Type:
Hydrolase
Mol. Mass.:
20480.58
Organism:
Homo sapiens (Human)
Description:
Residue:
185
  
Inhibitor
Name:
BDBM28884
Synonyms:
2-[(5Z)-4-oxo-5-({1-phenyl-3-[4-(piperidine-1-sulfonyl)phenyl]-1H-pyrazol-4-yl}methylidene)-2-sulfanylidene-1,3-thiazolidin-3-yl]ethane-1-sulfonic acid | rhodanine derivative, 43
Type:
Small organic molecule
Emp. Form.:
C26H26N4O6S4
Mol. Mass.:
618.768
SMILES:
OS(=O)(=O)CCN1C(=S)S\C(=C/c2cn(nc2-c2ccc(cc2)S(=O)(=O)N2CCCCC2)-c2ccccc2)C1=O
: