Target
Dual specificity protein phosphatase 3
Ligand
BDBM28851
Substrate
Meas. Tech.
ChEMBL_595099 (CHEMBL1047959)
Ki
3130±n/a nM
Citation
 Wu, SVossius, SRahmouni, SMiletic, AVVang, TVazquez-Rodriguez, JCerignoli, FArimura, YWilliams, SHayes, TMoutschen, MVasile, SPellecchia, MMustelin, TTautz, L Multidentate small-molecule inhibitors of vaccinia H1-related (VHR) phosphatase decrease proliferation of cervix cancer cells. J Med Chem 52:6716-23 (2009)  
Target
Name:
Dual specificity protein phosphatase 3
Synonyms:
DUS3_HUMAN Dual specificity protein phosphatase (VHR) Dual specificity protein phosphatase VHR Tyrosine-protein phosphatase non-receptor type 1 | VHR
Type:
Hydrolase
Mol. Mass.:
20480.58
Organism:
Homo sapiens (Human)
Description:
Residue:
185
  
Inhibitor
Name:
BDBM28851
Synonyms:
2-[(5Z)-5-{[5-(3-chlorophenyl)furan-2-yl]methylidene}-4-oxo-2-sulfanylidene-1,3-thiazolidin-3-yl]ethane-1-sulfonic acid | rhodanine derivative, 10
Type:
Small organic molecule
Emp. Form.:
C16H12ClNO5S3
Mol. Mass.:
429.918
SMILES:
OS(=O)(=O)CCN1C(=S)S\C(=C/c2ccc(o2)-c2cccc(Cl)c2)C1=O
: