Target
Dual specificity protein phosphatase 3
Ligand
BDBM50303187
Substrate
Meas. Tech.
ChEMBL_595099 (CHEMBL1047959)
Ki
12100±n/a nM
Citation
 Wu, SVossius, SRahmouni, SMiletic, AVVang, TVazquez-Rodriguez, JCerignoli, FArimura, YWilliams, SHayes, TMoutschen, MVasile, SPellecchia, MMustelin, TTautz, L Multidentate small-molecule inhibitors of vaccinia H1-related (VHR) phosphatase decrease proliferation of cervix cancer cells. J Med Chem 52:6716-23 (2009)  
Target
Name:
Dual specificity protein phosphatase 3
Synonyms:
DUS3_HUMAN Dual specificity protein phosphatase (VHR) Dual specificity protein phosphatase VHR Tyrosine-protein phosphatase non-receptor type 1 | VHR
Type:
Hydrolase
Mol. Mass.:
20480.58
Organism:
Homo sapiens (Human)
Description:
Residue:
185
  
Inhibitor
Name:
BDBM50303187
Synonyms:
5-((5-bromofuran-2-yl)methylene)-1-(4-fluorophenyl)-2-thioxodihydropyrimidine-4,6(1H,5H)-dione | CHEMBL565596
Type:
Small organic molecule
Emp. Form.:
C15H8BrFN2O3S
Mol. Mass.:
395.203
SMILES:
Fc1ccc(cc1)N1C(=S)NC(=O)\C(=C/c2ccc(Br)o2)C1=O
: