Target
Neutrophil elastase
Ligand
BDBM50303367
Substrate
Meas. Tech.
ChEMBL_595760 (CHEMBL1045283)
Kd
353±n/a nM
Citation
 Mulchande, JOliveira, RCarrasco, MGouveia, LGuedes, RCIley, JMoreira, R 4-Oxo-beta-lactams (azetidine-2,4-diones) are potent and selective inhibitors of human leukocyte elastase. J Med Chem 53:241-53 (2010)  
Target
Name:
Neutrophil elastase
Synonyms:
Bone marrow serine protease Coagulation factor X ELANE Elastase HLE Leukocyte elastase Medullasin Neutrophil elastase (HNE) PMN elastase Trypsin
Type:
Enzyme
Mol. Mass.:
28532.38
Organism:
Homo sapiens (Human)
Description:
P08246
Residue:
267
  
Inhibitor
Name:
BDBM50303367
Synonyms:
1-(2-((5-Phenyl-1,3,4-oxadiazol-2-ylthio)methyl)phenyl)-3,3-diethylazetidine-2,4-dione | CHEMBL568170
Type:
Small organic molecule
Emp. Form.:
C22H21N3O3S
Mol. Mass.:
407.485
SMILES:
CCC1(CC)C(=O)N(C1=O)c1ccccc1CSc1nnc(o1)-c1ccccc1
: