Target
Mitogen-activated protein kinase 14
Ligand
BDBM50115209
Substrate
Meas. Tech.
ChEMBL_596265 (CHEMBL1050681)
IC50
2300±n/a nM
Citation
 Klüter, SGrütter, CNaqvi, TRabiller, MSimard, JRPawar, VGetlik, MRauh, D Displacement assay for the detection of stabilizers of inactive kinase conformations. J Med Chem 53:357-67 (2010)  
Target
Name:
Mitogen-activated protein kinase 14
Synonyms:
CSAID-binding protein CSBP1 CSPB1 MAP kinase 14 MAP kinase p38 alpha MAPK14 MK14_HUMAN Mitogen-activated protein kinase p38 alpha Stress-activated protein kinase 2a | p38 MAP kinase alpha/beta
Type:
Serine/threonine-protein kinase
Mol. Mass.:
41286.76
Organism:
Homo sapiens (Human)
Description:
Q16539
Residue:
360
  
Inhibitor
Name:
BDBM50115209
Synonyms:
1-(3-tert-butyl-1-p-tolyl-1H-pyrazol-5-yl)-3-(4-(2-morpholinoethoxy)phenyl)urea 1-[3-tert-butyl-1-(4-methylphenyl)-1H-pyrazol-5-yl]-3-[4-(2-morpholin-4-ylethoxy)phenyl]urea CHEMBL101035
Type:
Small organic molecule
Emp. Form.:
C27H35N5O3
Mol. Mass.:
477.5985
SMILES:
Cc1ccc(cc1)-n1nc(cc1NC(=O)Nc1ccc(OCCN2CCOCC2)cc1)C(C)(C)C
: