Target
Prostaglandin E2 receptor EP3 subtype
Ligand
BDBM50303662
Substrate
Meas. Tech.
ChEMBL_596851 (CHEMBL1045310)
IC50
11±n/a nM
Citation
 Singh, JZeller, WZhou, NHategan, GMishra, RKPolozov, AYu, POnua, EZhang, JRamírez, JLSigthorsson, GThorsteinnsdottir, MKiselyov, ASZembower, DEAndrésson, TGurney, ME Structure-activity relationship studies leading to the identification of (2E)-3-[l-[(2,4-dichlorophenyl)methyl]-5-fluoro-3-methyl-lH-indol-7-yl]-N-[(4,5-dichloro-2-thienyl)sulfonyl]-2-propenamide (DG-041), a potent and selective prostanoid EP3 receptor antagonist, as a novel antiplatelet agent that J Med Chem 53:18-36 (2010)  
Target
Name:
Prostaglandin E2 receptor EP3 subtype
Synonyms:
PE2R3_MOUSE Prostaglandin E2 receptor EP3 isoform alpha Prostanoid EP3 receptor Ptgerep3
Type:
G-protein coupled receptor
Mol. Mass.:
40092.50
Organism:
Mus musculus (Mouse)
Description:
Residue:
365
  
Inhibitor
Name:
BDBM50303662
Synonyms:
3-(1-(2,4-dichlorobenzyl)-5-fluoro-3-methyl-1H-indol-7-yl)-N-(4,5-dichlorothiophen-2-ylsulfonyl)acrylamide | CHEMBL565591
Type:
Small organic molecule
Emp. Form.:
C23H15Cl4FN2O3S2
Mol. Mass.:
592.317
SMILES:
Cc1cn(Cc2ccc(Cl)cc2Cl)c2c(\C=C\C(=O)NS(=O)(=O)c3cc(Cl)c(Cl)s3)cc(F)cc12
: