Target
Adenosine receptor A1
Ligand
BDBM50304471
Substrate
Meas. Tech.
ChEMBL_603603 (CHEMBL1071155)
EC50
9100±n/a nM
Citation
 Aurelio, LValant, CFigler, HFlynn, BLLinden, JSexton, PMChristopoulos, AScammells, PJ 3- and 6-Substituted 2-amino-4,5,6,7-tetrahydrothieno[2,3-c]pyridines as A1 adenosine receptor allosteric modulators and antagonists. Bioorg Med Chem 17:7353-61 (2009)  
Target
Name:
Adenosine receptor A1
Synonyms:
A1 adenosine receptor (hA1) AA1R_HUMAN ADORA1 Adenosine A1-receptor Adenosine receptor A1 (hA1) | Adenosine transporter (AdT)
Type:
G Protein-Coupled Receptor (GPCR)
Mol. Mass.:
36520.92
Organism:
Homo sapiens (Human)
Description:
P30542
Residue:
326
  
Inhibitor
Name:
BDBM50304471
Synonyms:
(R)-Ethyl 2-amino-6-(2-(tert-butoxycarbonyl(methyl)-amino)-3-(4-chlorophenyl)propanoyl)-4,5,6,7-tetrahydrothieno[2,3-c]pyridine-3-carboxylate | CHEMBL595981
Type:
Small organic molecule
Emp. Form.:
C25H32ClN3O5S
Mol. Mass.:
522.057
SMILES:
CCOC(=O)c1c(N)sc2CN(CCc12)C(=O)[C@@H](Cc1ccc(Cl)cc1)N(C)C(=O)OC(C)(C)C
: