Target
Mu-type opioid receptor
Ligand
BDBM50304493
Substrate
Meas. Tech.
ChEMBL_603835 (CHEMBL1045630)
Ki
0.500000±n/a nM
Citation
 Yamamoto, TNair, PMa, SWDavis, PYamamura, HIVanderah, TWPorreca, FLai, JHruby, VJ The biological activity and metabolic stability of peptidic bifunctional compounds that are opioid receptor agonists and neurokinin-1 receptor antagonists with a cystine moiety. Bioorg Med Chem 17:7337-43 (2009)  
Target
Name:
Mu-type opioid receptor
Synonyms:
MOR-1 Mu-type opioid receptor (MOR) OPRM_RAT Opioid receptor B Ror-b
Type:
G Protein-Coupled Receptor (GPCR)
Mol. Mass.:
44503.11
Organism:
Rattus norvegicus (rat)
Description:
Competition binding assays were carried out using membrane preparations from transfected HN9.10 cells that constitutively expressed the mu opioid receptor.
Residue:
398
  
Inhibitor
Name:
BDBM50304493
Synonyms:
CHEMBL595972 Tyr-DAla-Gly-Phe-Met-NH2
Type:
Small organic molecule
Emp. Form.:
C28H38N6O6S
Mol. Mass.:
586.703
SMILES:
CSCC[C@H](NC(=O)[C@H](Cc1ccccc1)NC(=O)CNC(=O)[C@@H](C)NC(=O)[C@@H](N)Cc1ccc(O)cc1)C(N)=O
: