Target
Cannabinoid receptor 2
Ligand
BDBM50304920
Substrate
Meas. Tech.
ChEMBL_606628 (CHEMBL1071855)
Ki
12±n/a nM
Citation
 Sellitto, ILe Bourdonnec, BWorm, KGoodman, ASavolainen, MAChu, GHAjello, CWSaeui, CTLeister, LKCassel, JADehaven, RNLabuda, CJKoblish, MLittle, PJBrogdon, BLSmith, SADolle, RE Novel sulfamoyl benzamides as selective CB(2) agonists with improved in vitro metabolic stability. Bioorg Med Chem Lett 20:387-91 (2010)  
Target
Name:
Cannabinoid receptor 2
Synonyms:
CANNABINOID CB2 CB2 CB2B CNR2_HUMAN Cannabinoid CB2 receptor Cannabinoid receptor 2 (CB2R) | hCB2
Type:
G Protein-Coupled Receptor (GPCR)
Mol. Mass.:
39690.94
Organism:
Homo sapiens (Human)
Description:
P34972
Residue:
360
  
Inhibitor
Name:
BDBM50304920
Synonyms:
2,2-dimethyl-N-(7-(morpholinosulfonyl)-2,3-dihydro-1H-inden-5-yl)butanamide | CHEMBL603736
Type:
Small organic molecule
Emp. Form.:
C19H28N2O4S
Mol. Mass.:
380.502
SMILES:
CCC(C)(C)C(=O)Nc1cc2CCCc2c(c1)S(=O)(=O)N1CCOCC1
: