Target
Cannabinoid receptor 1
Ligand
BDBM50305401
Substrate
Meas. Tech.
ChEMBL_603744 (CHEMBL1039369)
IC50
1.6±n/a nM
Citation
 Cooper, MReceveur, JMBjurling, ENørregaard, PKNielsen, PASköld, NHögberg, T Exploring SAR features in diverse library of 4-cyanomethyl-pyrazole-3-carboxamides suitable for further elaborations as CB1 antagonists. Bioorg Med Chem Lett 20:26-30 (2010)  
Target
Name:
Cannabinoid receptor 1
Synonyms:
CANN6 CB-R CNR CNR1_HUMAN Cannabinoid receptor Cannabinoid receptor 1 (brain)
Type:
G Protein-Coupled Receptor (GPCR)
Mol. Mass.:
52868.96
Organism:
Homo sapiens (Human)
Description:
P21554
Residue:
472
  
Inhibitor
Name:
BDBM50305401
Synonyms:
1-(2-chlorophenyl)-5-(4-chlorophenyl)-4-(cyanomethyl)-N-(2,4-dichlorobenzyl)-1H-pyrazole-3-carboxamide | CHEMBL589893
Type:
Small organic molecule
Emp. Form.:
C25H16Cl4N4O
Mol. Mass.:
530.233
SMILES:
Clc1ccc(cc1)-c1c(CC#N)c(nn1-c1ccccc1Cl)C(=O)NCc1ccc(Cl)cc1Cl
: