Target
Cannabinoid receptor 1
Ligand
BDBM50305420
Substrate
Meas. Tech.
ChEMBL_606749 (CHEMBL1065339)
IC50
1.8±n/a nM
Citation
 Receveur, JMMurray, ALinget, JMNørregaard, PKCooper, MBjurling, ENielsen, PAHögberg, T Conversion of 4-cyanomethyl-pyrazole-3-carboxamides into CB1 antagonists with lowered propensity to pass the blood-brain-barrier. Bioorg Med Chem Lett 20:453-7 (2010)  
Target
Name:
Cannabinoid receptor 1
Synonyms:
CANN6 CB-R CNR CNR1_HUMAN Cannabinoid receptor Cannabinoid receptor 1 (brain)
Type:
G Protein-Coupled Receptor (GPCR)
Mol. Mass.:
52868.96
Organism:
Homo sapiens (Human)
Description:
P21554
Residue:
472
  
Inhibitor
Name:
BDBM50305420
Synonyms:
1-(2-chlorophenyl)-5-(4-chlorophenyl)-4-(cyanomethyl)-N-(piperidin-1-yl)-1H-pyrazole-3-carboxamide | CHEMBL596163
Type:
Small organic molecule
Emp. Form.:
C23H21Cl2N5O
Mol. Mass.:
454.352
SMILES:
Clc1ccc(cc1)-c1c(CC#N)c(nn1-c1ccccc1Cl)C(=O)NN1CCCCC1
: