Target
Hypoxia-inducible factor 1-alpha
Ligand
BDBM50306574
Substrate
Meas. Tech.
ChEMBL_610892 (CHEMBL1065047)
IC50
3100±n/a nM
Citation
 Shimizu, KMaruyama, MYasui, YMinegishi, HBan, HSNakamura, H Boron-containing phenoxyacetanilide derivatives as hypoxia-inducible factor (HIF)-1alpha inhibitors. Bioorg Med Chem Lett 20:1453-6 (2010)  
Target
Name:
Hypoxia-inducible factor 1-alpha
Synonyms:
BHLHE78 HIF-1-alpha, HIF-2-alpha HIF1A_HUMAN Hypoxia-inducible factor 1 alpha MOP1 von Hippel-Lindau disease tumor suppressor/Elongin-C/Elongin-B/HIF1A
Type:
Protein
Mol. Mass.:
92647.24
Organism:
Homo sapiens (Human)
Description:
Q16665
Residue:
826
  
Inhibitor
Name:
BDBM50306574
Synonyms:
2-(4-Adamantan-1-yl-phenoxy)-N-[2-hydroxy-5-(4,4,5,5-tetramethyl-[1,3,2]dioxaborolan-2-yl)-phenyl]-acetamide | CHEMBL603102
Type:
Small organic molecule
Emp. Form.:
C30H38BNO5
Mol. Mass.:
503.437
SMILES:
CC1(C)OB(OC1(C)C)c1ccc(O)c(NC(=O)COc2ccc(cc2)C23CC4CC(CC(C4)C2)C3)c1
: