Target
Cholinesterase
Ligand
BDBM50306689
Substrate
Meas. Tech.
ChEMBL_611613 (CHEMBL1068950)
IC50
400±n/a nM
Citation
 Dillon, GPGaynor, JMKhan, DCarolan, CGRyder, SAMarquez, JFReidy, SGilmer, JF Isosorbide-based cholinesterase inhibitors; replacement of 5-ester groups leading to increased stability. Bioorg Med Chem 18:1045-53 (2010)  
Target
Name:
Cholinesterase
Synonyms:
Acylcholine acylhydrolase Butyrylcholine esterase (BChE) Butyrylcholinesterase (BuChE) CHLE_HUMAN Cholinesterases Pseudocholinesterase
Type:
Homotetramer
Mol. Mass.:
68422.27
Organism:
Homo sapiens (Human)
Description:
P06276
Residue:
602
  
Inhibitor
Name:
BDBM50306689
Synonyms:
CHEMBL600013 | Isosorbide-di-(benzylcarbamate)
Type:
Small organic molecule
Emp. Form.:
C22H24N2O6
Mol. Mass.:
412.4358
SMILES:
O=C(NCc1ccccc1)O[C@@H]1CO[C@@H]2[C@H](CO[C@H]12)OC(=O)NCc1ccccc1
: