Target
P2Y purinoceptor 12
Ligand
BDBM50306989
Substrate
Meas. Tech.
ChEMBL_609034 (CHEMBL1064501)
Ki
0.98±n/a nM
Citation
 Parlow, JJBurney, MWCase, BLGirard, TJHall, KAHarris, PKHiebsch, RRHuff, RMLachance, RMMischke, DARapp, SRWoerndle, RSEnnis, MD Part II: piperazinyl-glutamate-pyridines as potent orally bioavailable P2Y12 antagonists for inhibition of platelet aggregation. Bioorg Med Chem Lett 20:1388-94 (2010)  
Target
Name:
P2Y purinoceptor 12
Synonyms:
ADP-glucose receptor HORK3 P2T(AC) P2Y(AC) P2Y(cyc) P2Y12 platelet ADP receptor Purinergic receptor P2Y12 | SP1999
Type:
Enzyme
Mol. Mass.:
39458.48
Organism:
Homo sapiens (Human)
Description:
Q9H244
Residue:
342
  
Inhibitor
Name:
BDBM50306989
Synonyms:
(S)-4-(4-(4-(dimethylcarbamoyl)piperidin-1-yl)-6-phenylpicolinamido)-5-oxo-5-(4-(pentyloxycarbonyl)piperazin-1-yl)pentanoic acid | CHEMBL601698
Type:
Small organic molecule
Emp. Form.:
C35H48N6O7
Mol. Mass.:
664.7916
SMILES:
CCCCCOC(=O)N1CCN(CC1)C(=O)[C@H](CCC(O)=O)NC(=O)c1cc(cc(n1)-c1ccccc1)N1CCC(CC1)C(=O)N(C)C
: