Target
Prostaglandin E2 receptor EP3 subtype
Ligand
BDBM50307433
Substrate
Meas. Tech.
ChEMBL_610979 (CHEMBL1070310)
Ki
0.26±n/a nM
Citation
 Asada, MIwahashi, MObitsu, TKinoshita, ANakai, YOnoda, TNagase, TTanaka, MYamaura, YTakizawa, HYoshikawa, KSato, KNarita, MOhuchida, SNakai, HToda, M 3-(2-Aminocarbonylphenyl)propanoic acid analogs as potent and selective EP3 receptor antagonists. part 2: optimization of the side chains to improve in vitro and in vivo potencies. Bioorg Med Chem 18:1641-58 (2010)  
Target
Name:
Prostaglandin E2 receptor EP3 subtype
Synonyms:
PE2R3_MOUSE Prostaglandin E2 receptor EP3 isoform alpha Prostanoid EP3 receptor Ptgerep3
Type:
G-protein coupled receptor
Mol. Mass.:
40092.50
Organism:
Mus musculus (Mouse)
Description:
Residue:
365
  
Inhibitor
Name:
BDBM50307433
Synonyms:
3-[2-({[1-(3-Chloro-4-fluorophenyl)-3-methylbutyl]-amino}carbonyl)-4-(phenoxymethyl)phenyl]propanoic acid | CHEMBL597786
Type:
Small organic molecule
Emp. Form.:
C28H29ClFNO4
Mol. Mass.:
497.986
SMILES:
CC(C)CC(NC(=O)c1cc(COc2ccccc2)ccc1CCC(O)=O)c1ccc(F)c(Cl)c1
: