Target
Prostaglandin E2 receptor EP3 subtype
Ligand
BDBM50307437
Substrate
Meas. Tech.
ChEMBL_610979 (CHEMBL1070310)
Ki
0.21±n/a nM
Citation
 Asada, MIwahashi, MObitsu, TKinoshita, ANakai, YOnoda, TNagase, TTanaka, MYamaura, YTakizawa, HYoshikawa, KSato, KNarita, MOhuchida, SNakai, HToda, M 3-(2-Aminocarbonylphenyl)propanoic acid analogs as potent and selective EP3 receptor antagonists. part 2: optimization of the side chains to improve in vitro and in vivo potencies. Bioorg Med Chem 18:1641-58 (2010)  
Target
Name:
Prostaglandin E2 receptor EP3 subtype
Synonyms:
PE2R3_MOUSE Prostaglandin E2 receptor EP3 isoform alpha Prostanoid EP3 receptor Ptgerep3
Type:
G-protein coupled receptor
Mol. Mass.:
40092.50
Organism:
Mus musculus (Mouse)
Description:
Residue:
365
  
Inhibitor
Name:
BDBM50307437
Synonyms:
3-[4-[(3-Chlorophenoxy)methyl]-2-({[1-(3,5-dimethylphenyl)-3-methylbutyl]amino}carbonyl)phenyl]propanoic acid | CHEMBL599810
Type:
Small organic molecule
Emp. Form.:
C30H34ClNO4
Mol. Mass.:
508.048
SMILES:
CC(C)CC(NC(=O)c1cc(COc2cccc(Cl)c2)ccc1CCC(O)=O)c1cc(C)cc(C)c1
: