Target
Prostaglandin E2 receptor EP3 subtype
Ligand
BDBM50307443
Substrate
Meas. Tech.
ChEMBL_610979 (CHEMBL1070310)
Ki
0.27±n/a nM
Citation
 Asada, MIwahashi, MObitsu, TKinoshita, ANakai, YOnoda, TNagase, TTanaka, MYamaura, YTakizawa, HYoshikawa, KSato, KNarita, MOhuchida, SNakai, HToda, M 3-(2-Aminocarbonylphenyl)propanoic acid analogs as potent and selective EP3 receptor antagonists. part 2: optimization of the side chains to improve in vitro and in vivo potencies. Bioorg Med Chem 18:1641-58 (2010)  
Target
Name:
Prostaglandin E2 receptor EP3 subtype
Synonyms:
PE2R3_MOUSE Prostaglandin E2 receptor EP3 isoform alpha Prostanoid EP3 receptor Ptgerep3
Type:
G-protein coupled receptor
Mol. Mass.:
40092.50
Organism:
Mus musculus (Mouse)
Description:
Residue:
365
  
Inhibitor
Name:
BDBM50307443
Synonyms:
3-{2-({[1-(3,5-Dimethylphenyl)-3-methylbutyl]amino}-carbonyl)-4-[(3-methoxyphenoxy)methyl]phenyl}propanoic acid | CHEMBL599405
Type:
Small organic molecule
Emp. Form.:
C31H37NO5
Mol. Mass.:
503.6292
SMILES:
COc1cccc(OCc2ccc(CCC(O)=O)c(c2)C(=O)NC(CC(C)C)c2cc(C)cc(C)c2)c1
: