Target
Prostaglandin E2 receptor EP3 subtype
Ligand
BDBM50307448
Substrate
Meas. Tech.
ChEMBL_610980 (CHEMBL1070311)
IC50
3.7±n/a nM
Citation
 Asada, MIwahashi, MObitsu, TKinoshita, ANakai, YOnoda, TNagase, TTanaka, MYamaura, YTakizawa, HYoshikawa, KSato, KNarita, MOhuchida, SNakai, HToda, M 3-(2-Aminocarbonylphenyl)propanoic acid analogs as potent and selective EP3 receptor antagonists. part 2: optimization of the side chains to improve in vitro and in vivo potencies. Bioorg Med Chem 18:1641-58 (2010)  
Target
Name:
Prostaglandin E2 receptor EP3 subtype
Synonyms:
PE2R3_MOUSE Prostaglandin E2 receptor EP3 isoform alpha Prostanoid EP3 receptor Ptgerep3
Type:
G-protein coupled receptor
Mol. Mass.:
40092.50
Organism:
Mus musculus (Mouse)
Description:
Residue:
365
  
Inhibitor
Name:
BDBM50307448
Synonyms:
3-[4-[(3-Cyanophenoxy)methyl]-2-({[1-(3,4-dimethoxyphenyl)-3-methylbutyl]amino}carbonyl)phenyl]propanoic acid | CHEMBL597367
Type:
Small organic molecule
Emp. Form.:
C31H34N2O6
Mol. Mass.:
530.6115
SMILES:
COc1ccc(cc1OC)C(CC(C)C)NC(=O)c1cc(COc2cccc(c2)C#N)ccc1CCC(O)=O
: