Target
5-hydroxytryptamine receptor 7
Ligand
BDBM50307501
Substrate
Meas. Tech.
ChEMBL_611967 (CHEMBL1072174)
Ki
0.3±n/a nM
Citation
 Badarau, EBugno, RSuzenet, FBojarski, AJFinaru, ALGuillaumet, G SAR studies on new bis-aryls 5-HT7 ligands: Synthesis and molecular modeling. Bioorg Med Chem 18:1958-67 (2010)  
Target
Name:
5-hydroxytryptamine receptor 7
Synonyms:
5-HT-7 5-HT7 5-HT7S 5HT7 HTR7 | Serotonin receptor 7
Type:
G Protein-Coupled Receptor (GPCR)
Mol. Mass.:
53573.08
Organism:
Homo sapiens (Human)
Description:
P34969
Residue:
479
  
Inhibitor
Name:
BDBM50307501
Synonyms:
(6S)-N,N-dipropyl-5,6,7,8-tetrahydro-1,1'-binaphthyl-6-amine | CHEMBL596959
Type:
Small organic molecule
Emp. Form.:
C26H31N
Mol. Mass.:
357.531
SMILES:
CCCN(CCC)[C@H]1CCc2c(C1)cccc2-c1cccc2ccccc12
: