Target
P2Y purinoceptor 12
Ligand
BDBM50307557
Substrate
Meas. Tech.
ChEMBL_612285 (CHEMBL1064897)
Ki
1.4±n/a nM
Citation
 Parlow, JJBurney, MWCase, BLGirard, TJHall, KAHarris, PKHiebsch, RRHuff, RMLachance, RMMischke, DARapp, SRWoerndle, RSEnnis, MD Piperazinyl glutamate pyridines as potent orally bioavailable P2Y12 antagonists for inhibition of platelet aggregation. J Med Chem 53:2010-37 (2010)  
Target
Name:
P2Y purinoceptor 12
Synonyms:
ADP-glucose receptor HORK3 P2T(AC) P2Y(AC) P2Y(cyc) P2Y12 platelet ADP receptor Purinergic receptor P2Y12 | SP1999
Type:
Enzyme
Mol. Mass.:
39458.48
Organism:
Homo sapiens (Human)
Description:
Q9H244
Residue:
342
  
Inhibitor
Name:
BDBM50307557
Synonyms:
(4S)4-{[(4-{[(2-Methoxyethoxy)carbonyl]amino}-6-phenylpyridin-2-yl)carbonyl]amino}-5-oxo-5-{4-[(pentyloxy)carbonyl]piperazin-1-yl}pentanoic acid | CHEMBL578094
Type:
Small organic molecule
Emp. Form.:
C35H49N5O9
Mol. Mass.:
683.7917
SMILES:
CCCCCOC(=O)N1CCN(CC1)C(=O)[C@H](CCC(=O)OC(C)(C)C)NC(=O)c1cc(NC(=O)OCCOC)cc(n1)-c1ccccc1
: