Target
P2Y purinoceptor 12
Ligand
BDBM50307002
Substrate
Meas. Tech.
ChEMBL_612285 (CHEMBL1064897)
Ki
1.1±n/a nM
Citation
 Parlow, JJBurney, MWCase, BLGirard, TJHall, KAHarris, PKHiebsch, RRHuff, RMLachance, RMMischke, DARapp, SRWoerndle, RSEnnis, MD Piperazinyl glutamate pyridines as potent orally bioavailable P2Y12 antagonists for inhibition of platelet aggregation. J Med Chem 53:2010-37 (2010)  
Target
Name:
P2Y purinoceptor 12
Synonyms:
ADP-glucose receptor HORK3 P2T(AC) P2Y(AC) P2Y(cyc) P2Y12 platelet ADP receptor Purinergic receptor P2Y12 | SP1999
Type:
Enzyme
Mol. Mass.:
39458.48
Organism:
Homo sapiens (Human)
Description:
Q9H244
Residue:
342
  
Inhibitor
Name:
BDBM50307002
Synonyms:
(4S)-5-Oxo-5-{4-[(pentyloxy)carbonyl]piperazin-1-yl}-4-[({6-phenyl-4-[4-(pyrrolidin-1-ylmethyl)piperidin-1-yl]pyridin-2-yl}-carbonyl)amino]pentanoic Acid CHEMBL601692
Type:
Small organic molecule
Emp. Form.:
C37H52N6O6
Mol. Mass.:
676.8454
SMILES:
CCCCCOC(=O)N1CCN(CC1)C(=O)[C@H](CCC(O)=O)NC(=O)c1cc(cc(n1)-c1ccccc1)N1CCC(CN2CCCC2)CC1
: