Target
Extracellular calcium-sensing receptor
Ligand
BDBM50308090
Substrate
Meas. Tech.
ChEMBL_610755 (CHEMBL1064390)
IC50
1.4±n/a nM
Citation
 Widler, LAltmann, EBeerli, RBreitenstein, WBouhelal, RBuhl, TGamse, RGerspacher, MHalleux, CJohn, MRLehmann, HKalb, OKneissel, MMissbach, MMüller, IRReidemeister, SRenaud, JTaillardat, ATommasi, RWeiler, SWolf, RMSeuwen, K 1-Alkyl-4-phenyl-6-alkoxy-1H-quinazolin-2-ones: a novel series of potent calcium-sensing receptor antagonists. J Med Chem 53:2250-63 (2010)  
Target
Name:
Extracellular calcium-sensing receptor
Synonyms:
CASR CaR Calcium-sensing receptor (CaSR) GPRC2A Parathyroid Cell calcium-sensing receptor Synonyms=GPRC2A | hCasR
Type:
Protein
Mol. Mass.:
120663.13
Organism:
Homo sapiens (Human)
Description:
P41180
Residue:
1078
  
Inhibitor
Name:
BDBM50308090
Synonyms:
1-(3-Ethoxy-4-methoxy-benzyl)-4-(4-isopropyl-phenyl)-6-propargyloxy-1H-quinazolin-2-one | CHEMBL597800
Type:
Small organic molecule
Emp. Form.:
C30H30N2O4
Mol. Mass.:
482.5702
SMILES:
CCOc1cc(Cn2c3ccc(OCC#C)cc3c(nc2=O)-c2ccc(cc2)C(C)C)ccc1OC
: