Target
Sodium-dependent serotonin transporter
Ligand
BDBM50302935
Substrate
Meas. Tech.
ChEMBL_610771 (CHEMBL1064406)
IC50
>100±n/a nM
Citation
 Carroll, FIBlough, BEMascarella, SWNavarro, HAEaton, JBLukas, RJDamaj, MI Synthesis and biological evaluation of bupropion analogues as potential pharmacotherapies for smoking cessation. J Med Chem 53:2204-14 (2010)  
Target
Name:
Sodium-dependent serotonin transporter
Synonyms:
5-HT Transporter 5HTT SC6A4_HUMAN SLC6A4 Serotonin transporter (5HTT) Sodium-dependent serotonin transporter (SERT) | Solute carrier family 6 member 4
Type:
Multi-pass membrane protein
Mol. Mass.:
70322.51
Organism:
Homo sapiens (Human)
Description:
P31645
Residue:
630
  
Inhibitor
Name:
BDBM50302935
Synonyms:
3-(tert-butylamino)-1-(3-chlorophenyl)-2-methylpropan-1-one | CHEMBL567481
Type:
Small organic molecule
Emp. Form.:
C14H20ClNO
Mol. Mass.:
253.768
SMILES:
CC(CNC(C)(C)C)C(=O)c1cccc(Cl)c1
: