Target
Sodium-dependent dopamine transporter
Ligand
BDBM50302927
Substrate
Meas. Tech.
ChEMBL_610769 (CHEMBL1064404)
IC50
56±n/a nM
Citation
 Carroll, FIBlough, BEMascarella, SWNavarro, HAEaton, JBLukas, RJDamaj, MI Synthesis and biological evaluation of bupropion analogues as potential pharmacotherapies for smoking cessation. J Med Chem 53:2204-14 (2010)  
Target
Name:
Sodium-dependent dopamine transporter
Synonyms:
DA transporter DAT1 Dopamine transporter protein (DAT) SC6A3_HUMAN Sodium-dependent dopamine transporter Solute carrier family 6 member 3
Type:
Multi-pass membrane protein
Mol. Mass.:
68497.11
Organism:
Homo sapiens (Human)
Description:
Q01959
Residue:
620
  
Inhibitor
Name:
BDBM50302927
Synonyms:
2-(N-tert-Butylamino)-3'-chloropentanophenone CHEMBL569465
Type:
Small organic molecule
Emp. Form.:
C15H22ClNO
Mol. Mass.:
267.794
SMILES:
CCCC(NC(C)(C)C)C(=O)c1cccc(Cl)c1
: