Target
P2Y purinoceptor 1
Ligand
BDBM50118242
Substrate
Meas. Tech.
ChEMBL_613869 (CHEMBL1067692)
EC50
2.5±n/a nM
Citation
 Eliahu, SBarr, HMCamden, JWeisman, GAFischer, B A novel insulin secretagogue based on a dinucleoside polyphosphate scaffold. J Med Chem 53:2472-81 (2010)  
Target
Name:
P2Y purinoceptor 1
Synonyms:
ATP receptor P2RY1_HUMAN P2Y1 Purinergic receptor P2Y1
Type:
Enzyme
Mol. Mass.:
42090.25
Organism:
Homo sapiens (Human)
Description:
P47900
Residue:
373
  
Inhibitor
Name:
BDBM50118242
Synonyms:
((2R,3S,4R,5R)-5-(6-amino-2-(methylthio)-9H-purin-9-yl)-3,4-dihydroxytetrahydrofuran-2-yl)methyl trihydrogen diphosphate 2-MeS-ADP CHEMBL435402 | [({[(2R,3S,4R,5R)-5-[6-amino-2-(methylsulfanyl)-9H-purin-9-yl]-3,4-dihydroxyoxolan-2-yl]methoxy}(hydroxy)phosphoryl)oxy]phosphonic acid
Type:
Small organic molecule
Emp. Form.:
C11H17N5O10P2S
Mol. Mass.:
473.293
SMILES:
CSc1nc(N)c2ncn([C@@H]3O[C@H](COP(O)(=O)OP(O)(O)=O)[C@@H](O)[C@H]3O)c2n1
: