Target
Cytosolic phospholipase A2
Ligand
BDBM50277799
Substrate
Meas. Tech.
ChEMBL_611785 (CHEMBL1066442)
IC50
16±n/a nM
Citation
 Forster, LLudwig, JKaptur, MBovens, SElfringhoff, ASHoltfrerich, ALehr, M 1-Indol-1-yl-propan-2-ones and related heterocyclic compounds as dual inhibitors of cytosolic phospholipase A(2)alpha and fatty acid amide hydrolase. Bioorg Med Chem 18:945-52 (2010)  
Target
Name:
Cytosolic phospholipase A2
Synonyms:
CPLA2 PA24A_HUMAN PLA2G4A Phospholipase A2 | Phospholipase A2 group IVA
Type:
Protein
Mol. Mass.:
85219.30
Organism:
Homo sapiens (Human)
Description:
P47712
Residue:
749
  
Inhibitor
Name:
BDBM50277799
Synonyms:
1-(3-(4-octylphenoxy)-2-oxopropyl)-1H-benzo[d][1,2,3]triazole-6-carboxylic acid | CHEMBL484954
Type:
Small organic molecule
Emp. Form.:
C24H29N3O4
Mol. Mass.:
423.5048
SMILES:
CCCCCCCCc1ccc(OCC(=O)Cn2nnc3ccc(cc23)C(O)=O)cc1
: