Target
B1 bradykinin receptor
Ligand
BDBM50309006
Substrate
Meas. Tech.
ChEMBL_612385 (CHEMBL1066271)
IC50
0.48±n/a nM
Citation
 Schaudt, MLocardi, EZischinsky, GStragies, RPfeifer, JRGibson, CScharn, DRichter, UKalkhof, HDinkel, KSchnatbaum, K Novel small molecule bradykinin B1 receptor antagonists. Part 1: benzamides and semicarbazides. Bioorg Med Chem Lett 20:1225-8 (2010)  
Target
Name:
B1 bradykinin receptor
Synonyms:
B1 BRADYKININ B1R BK-1 receptor BRADYB1 | Bradykinin B1 receptor
Type:
Enzyme
Mol. Mass.:
40508.87
Organism:
Homo sapiens (Human)
Description:
P46663
Residue:
353
  
Inhibitor
Name:
BDBM50309006
Synonyms:
(R)-N-(1-(5-(5-chloro-3-fluoro-2-(5-methyl-1,2,4-oxadiazol-3-yl)phenyl)-3-fluoropyridin-2-yl)ethyl)-1-ethyl-2-(2,2,2-trifluoroacetyl)hydrazinecarboxamide | CHEMBL598124
Type:
Small organic molecule
Emp. Form.:
C21H18ClF5N6O3
Mol. Mass.:
532.851
SMILES:
CCN(NC(=O)C(F)(F)F)C(=O)N[C@H](C)c1ncc(cc1F)-c1cc(Cl)cc(F)c1-c1noc(C)n1
: