Target
N-acylethanolamine-hydrolyzing acid amidase
Ligand
BDBM50171291
Substrate
Meas. Tech.
ChEMBL_608785 (CHEMBL1068377)
IC50
19000±n/a nM
Citation
 Saturnino, CPetrosino, SLigresti, APalladino, CDe Martino, GBisogno, TDi Marzo, V Synthesis and biological evaluation of new potential inhibitors of N-acylethanolamine hydrolyzing acid amidase. Bioorg Med Chem Lett 20:1210-3 (2010)  
Target
Name:
N-acylethanolamine-hydrolyzing acid amidase
Synonyms:
ASAH-like protein Acid ceramidase-like protein N-acylsphingosine amidohydrolase-like NAAA PLT
Type:
Enzyme
Mol. Mass.:
40073.12
Organism:
Homo sapiens (Human)
Description:
Q02083
Residue:
359
  
Inhibitor
Name:
BDBM50171291
Synonyms:
CHEMBL139056 cyclohexyl palmitate
Type:
Small organic molecule
Emp. Form.:
C22H42O2
Mol. Mass.:
338.5677
SMILES:
CCCCCCCCCCCCCCCC(=O)OC1CCCCC1
: