Target
Intestinal-type alkaline phosphatase
Ligand
BDBM50219348
Substrate
Meas. Tech.
ChEMBL_610124 (CHEMBL1074489)
IC50
>5000±n/a nM
Citation
 Lanier, MSergienko, ESimão, AMSu, YChung, TMillán, JLCashman, JR Design and synthesis of selective inhibitors of placental alkaline phosphatase. Bioorg Med Chem 18:573-9 (2010)  
Target
Name:
Intestinal-type alkaline phosphatase
Synonyms:
ALPI Intestinal alkaline phosphatase | PPBI_HUMAN
Type:
PROTEIN
Mol. Mass.:
56804.94
Organism:
Homo sapiens (Human)
Description:
ChEMBL_1278525
Residue:
528
  
Inhibitor
Name:
BDBM50219348
Synonyms:
(2S)-2-amino-4-methylpentanoic acid (S)-leucine L-Leucin L-leucine
Type:
Small organic molecule
Emp. Form.:
C6H13NO2
Mol. Mass.:
131.1729
SMILES:
CC(C)C[C@H](N)C(O)=O
: