Target
Fatty-acid amide hydrolase 1
Ligand
BDBM50309720
Substrate
Meas. Tech.
ChEMBL_610820 (CHEMBL1068137)
IC50
8.3±n/a nM
Citation
 Sit, SYConway, CMXie, KBertekap, RBourin, CBurris, KD Oxime carbamate--discovery of a series of novel FAAH inhibitors. Bioorg Med Chem Lett 20:1272-7 (2010)  
Target
Name:
Fatty-acid amide hydrolase 1
Synonyms:
Anandamide amidohydrolase FAAH FAAH1_HUMAN Fatty-acid amide hydrolase (FAAH) Oleamide hydrolase 1
Type:
Protein
Mol. Mass.:
63071.19
Organism:
Homo sapiens (Human)
Description:
O00519
Residue:
579
  
Inhibitor
Name:
BDBM50309720
Synonyms:
CHEMBL597729 | nicotinaldehyde O-4-(hexyloxy)phenylcarbamoyl oxime
Type:
Small organic molecule
Emp. Form.:
C19H23N3O3
Mol. Mass.:
341.4042
SMILES:
CCCCCCOc1ccc(NC(=O)O\N=C\c2cccnc2)cc1
: