Target
Fatty-acid amide hydrolase 1
Ligand
BDBM50309750
Substrate
Meas. Tech.
ChEMBL_610820 (CHEMBL1068137)
IC50
12±n/a nM
Citation
 Sit, SYConway, CMXie, KBertekap, RBourin, CBurris, KD Oxime carbamate--discovery of a series of novel FAAH inhibitors. Bioorg Med Chem Lett 20:1272-7 (2010)  
Target
Name:
Fatty-acid amide hydrolase 1
Synonyms:
Anandamide amidohydrolase FAAH FAAH1_HUMAN Fatty-acid amide hydrolase (FAAH) Oleamide hydrolase 1
Type:
Protein
Mol. Mass.:
63071.19
Organism:
Homo sapiens (Human)
Description:
O00519
Residue:
579
  
Inhibitor
Name:
BDBM50309750
Synonyms:
4-fluorophenyl 1-(4-butoxyphenyl)propylcarbamate | CHEMBL604388
Type:
Small organic molecule
Emp. Form.:
C20H24FNO3
Mol. Mass.:
345.4079
SMILES:
CCCCOc1ccc(cc1)C(CC)NC(=O)Oc1ccc(F)cc1
: