Target
Fatty-acid amide hydrolase 1
Ligand
BDBM50309764
Substrate
Meas. Tech.
ChEMBL_610820 (CHEMBL1068137)
IC50
8.4±n/a nM
Citation
 Sit, SYConway, CMXie, KBertekap, RBourin, CBurris, KD Oxime carbamate--discovery of a series of novel FAAH inhibitors. Bioorg Med Chem Lett 20:1272-7 (2010)  
Target
Name:
Fatty-acid amide hydrolase 1
Synonyms:
Anandamide amidohydrolase FAAH FAAH1_HUMAN Fatty-acid amide hydrolase (FAAH) Oleamide hydrolase 1
Type:
Protein
Mol. Mass.:
63071.19
Organism:
Homo sapiens (Human)
Description:
O00519
Residue:
579
  
Inhibitor
Name:
BDBM50309764
Synonyms:
CHEMBL597294 | propan-2-one O-4-(heptyloxy)phenylcarbamoyl oxime
Type:
Small organic molecule
Emp. Form.:
C17H26N2O3
Mol. Mass.:
306.3999
SMILES:
[#6]-[#6]-[#6]-[#6]-[#6]-[#6]-[#6]-[#8]-c1ccc(-[#7]-[#6](=O)-[#8]\[#7]=[#6](\[#6])-[#6])cc1
: