Target
Cannabinoid receptor 1
Ligand
BDBM50309988
Substrate
Meas. Tech.
ChEMBL_612189 (CHEMBL1074127)
IC50
1.8±n/a nM
Citation
 Seo, HJKim, MJLee, SHLee, SHJung, MEKim, MSAhn, KKim, JLee, J Synthesis and structure-activity relationship of 1,2,4-triazole-containing diarylpyrazolyl carboxamide as CB1 cannabinoid receptor-ligand. Bioorg Med Chem 18:1149-62 (2010)  
Target
Name:
Cannabinoid receptor 1
Synonyms:
Brain-type cannabinoid receptor CB-R CNR1_RAT Cannabinoid receptor Cnr1 | Skr6
Type:
G Protein-Coupled Receptor (GPCR)
Mol. Mass.:
52856.55
Organism:
Rattus norvegicus (rat)
Description:
P20272
Residue:
473
  
Inhibitor
Name:
BDBM50309988
Synonyms:
4-((1H-1,2,4-Triazol-1-yl)methyl)-N-(1-(4-bromophenyl)ethyl)-1-(2-chlorophenyl)-5-(4-chlorophenyl)-1H-pyrazole-3-carboxamide | CHEMBL602102
Type:
Small organic molecule
Emp. Form.:
C27H21BrCl2N6O
Mol. Mass.:
596.305
SMILES:
Cc1cc(Br)ccc1CNC(=O)c1nn(c(c1Cn1cncn1)-c1ccc(Cl)cc1)-c1ccccc1Cl
: