Target
Sodium-dependent serotonin transporter
Ligand
BDBM50310653
Substrate
Meas. Tech.
ChEMBL_620406 (CHEMBL1112301)
Ki
10±n/a nM
Citation
 Wakenhut, FAllan, GAFish, PVFray, MJHarrison, ACMcCoy, RPhillips, SCRyckmans, TStobie, AWestbrook, DWestbrook, SLWhitlock, GA N-[(3S)-Pyrrolidin-3-yl]benzamides as novel dual serotonin and noradrenaline reuptake inhibitors: impact of small structural modifications on P-gp recognition and CNS penetration. Bioorg Med Chem Lett 19:5078-81 (2009)  
Target
Name:
Sodium-dependent serotonin transporter
Synonyms:
5-HT Transporter 5HTT SC6A4_HUMAN SLC6A4 Serotonin transporter (5HTT) Sodium-dependent serotonin transporter (SERT) | Solute carrier family 6 member 4
Type:
Multi-pass membrane protein
Mol. Mass.:
70322.51
Organism:
Homo sapiens (Human)
Description:
P31645
Residue:
630
  
Inhibitor
Name:
BDBM50310653
Synonyms:
(S)-3-chloro-2-fluoro-N-isobutyl-N-(pyrrolidin-3-yl)benzamide | CHEMBL1078073
Type:
Small organic molecule
Emp. Form.:
C15H20ClFN2O
Mol. Mass.:
298.784
SMILES:
CC(C)CN([C@H]1CCNC1)C(=O)c1cccc(Cl)c1F
: