Target
Nociceptin receptor
Ligand
BDBM50311486
Substrate
Meas. Tech.
ChEMBL_622957 (CHEMBL1112209)
Ki
0.600000±n/a nM
Citation
 Palin, RClark, JKEvans, LFeilden, HFletcher, DHamilton, NMHoughton, AKJones, PSMcArthur, DMontgomery, BRatcliffe, PDSmith, ARSutherland, AWeston, MAWishart, G Rapid access towards follow-up NOP receptor agonists using a knowledge based approach. Bioorg Med Chem Lett 19:6441-6 (2009)  
Target
Name:
Nociceptin receptor
Synonyms:
KOR-3 Mu-type opioid receptor (Mu) Nociceptin Receptor (ORL1 Receptor) Nociceptin receptor (ORL-1) Nociceptin/Orphanin FQ, NOP receptor OPIATE ORL-1 OPRL1 protein ORL1 Opioid receptor like-1 Orphanin FQ receptor (ORL1) | P41146
Type:
G Protein-Coupled Receptor (GPCR)
Mol. Mass.:
40702.87
Organism:
Homo sapiens (Human)
Description:
P41146
Residue:
370
  
Inhibitor
Name:
BDBM50311486
Synonyms:
2-[1-(1-Cyclodecyl-piperidin-4-yl)-2,2-dioxo-1,4-dihydro-2H-2lambda*6*-benzo[1,2,6]thiadiazin-3-yl]-N-methyl-acetamide | CHEMBL1079400
Type:
Small organic molecule
Emp. Form.:
C25H40N4O3S
Mol. Mass.:
476.675
SMILES:
CNC(=O)CN1Cc2ccccc2N(C2CCN(CC2)C2CCCCCCCCC2)S1(=O)=O
: