Target
Low molecular weight protein-tyrosine phosphatase A
Ligand
BDBM50312226
Substrate
Meas. Tech.
ChEMBL_621991 (CHEMBL1106782)
Ki
>100000±n/a nM
Citation
 Rawls, KALang, PTTakeuchi, JImamura, SBaguley, TDGrundner, CAlber, TEllman, JA Fragment-based discovery of selective inhibitors of the Mycobacterium tuberculosis protein tyrosine phosphatase PtpA. Bioorg Med Chem Lett 19:6851-4 (2009)  
Target
Name:
Low molecular weight protein-tyrosine phosphatase A
Synonyms:
PTPA_MYCTU Probable low molecular weight protein-tyrosine-phosphatase mptpA | ptpA
Type:
Hydrolase
Mol. Mass.:
17891.84
Organism:
Mycobacterium tuberculosis
Description:
Residue:
163
  
Inhibitor
Name:
BDBM50312226
Synonyms:
4-(difluoro(phosphono)methyl)benzoic acid | CHEMBL1081059
Type:
Small organic molecule
Emp. Form.:
C8H7F2O5P
Mol. Mass.:
252.1087
SMILES:
OC(=O)c1ccc(cc1)C(F)(F)P(O)(O)=O
: